{"text_format":"1","workbook":"xlsx","n_sheets":3,"sheets":["Zipcode LookUp","Zips","Sheet1"],"not_rendered":{"charts":0,"images":1,"macros":1,"external_links":0,"defined_names":4,"comments":0,"pivot_tables":0},"unopened":[],"bounds":{"document_bytes":16777216,"sheet_cells":100000,"rows_first":2000,"rows_last":500,"rows_between":2000,"halvings":0,"cell_chars":16384,"cell_head_chars":4096},"cells_cut":0,"cells_raw":0,"read":"whole","date_system":"1900"}

{"sheet":"Zipcode LookUp","index":0,"n_rows":21,"n_cols":20,"rows_kept":21,"cut":false,"hidden":false,"merged":[[6,5,7,5],[7,2,11,2],[9,5,11,5]]}
[]
[]
[]
[]
[]
[]
[null," ZIP CODE:",null,null,null,{"$f":"IF($S$18=\"APCO CUSTOMER\",\"APCO CUSTOMER\",IF($S$18=\"POSSIBLE APCO CUSTOMER\",\"POSSIBLE APCO CUSTOMER\",IF($S$18=\"NOT IN REBATE AREA\",\"NOT IN REBATE AREA\",\"\")))","v":""}]
[]
[]
[null,null,null,null,null,{"$f":"IF($S$18=\"POSSIBLE APCO CUSTOMER\",\"Click Here to Verify\",\"\")","v":""}]
[]
[]
[]
[]
[null,null,null,null,null,null,null,null,null,null,null,null,null,null,null,null,null,null,"CODE"]
[]
[null,null,null,null,null,null,null,null,null,null,null,null,null,null,null,null,null,null,{"$f":"IF(ISNA(INDEX(Zips!A2:E243,MATCH(C7,Zips!B2:B243,0),2)),\"\",INDEX(Zips!A2:E243,MATCH(C7,Zips!B2:B243,0),2))","v":""},"zip match"]
[null,null,null,null,null,null,null,null,null,null,null,null,null,null,null,null,null,null,{"$f":"IF(S19=\"NOT IN REBATE AREA\",\"NOT IN REBATE AREA\", IF(ISNA(INDEX(Zips!A2:E243,MATCH(C7,Zips!B2:B243,0))),\"\",INDEX(Zips!A2:E243,MATCH(C7,Zips!B2:B243,0),4)))","v":""},"area status"]
[null,null,null,null,null,null,null,null,null,null,null,null,null,null,null,null,null,null,{"$f":"IF(ISBLANK(C7),\"\",IF(C7=S17,\"\",\"NOT IN REBATE AREA\"))","v":""},"not Rebate Customer"]
[]
[null,null,null,null,null,null,null,null,null,null,null,null,null,null,null,null,null,null,{"$f":"IF(S19=\"NOT IN REBATE AREA\",\"NOT IN REBATE AREA\", IF(ISNA(INDEX(Zips!A2:E243,MATCH(C7,Zips!B2:B243,0),5)),\"\",INDEX(Zips!A2:E243,MATCH(C7,Zips!B2:B243,0),5)))","v":""},"EKPC"]

{"sheet":"Zips","index":1,"n_rows":243,"n_cols":5,"rows_kept":243,"cut":false,"hidden":true,"merged":[]}
["Zip","Zip","State","Program Status"]
[22902,22902,"VA","POSSIBLE APCO CUSTOMER","POSSIBLE APCO CUSTOMER"]
[22903,22903,"VA","POSSIBLE APCO CUSTOMER","POSSIBLE APCO CUSTOMER"]
[22920,22920,"VA","POSSIBLE APCO CUSTOMER","POSSIBLE APCO CUSTOMER"]
[22922,22922,"VA","POSSIBLE APCO CUSTOMER","POSSIBLE APCO CUSTOMER"]
[22931,22931,"VA","POSSIBLE APCO CUSTOMER","POSSIBLE APCO CUSTOMER"]
[22937,22937,"VA","POSSIBLE APCO CUSTOMER","POSSIBLE APCO CUSTOMER"]
[22938,22938,"VA","POSSIBLE APCO CUSTOMER","POSSIBLE APCO CUSTOMER"]
[22946,22946,"VA","APCO CUSTOMER","APCO CUSTOMER"]
[22949,22949,"VA","POSSIBLE APCO CUSTOMER","POSSIBLE APCO CUSTOMER"]
[22959,22959,"VA","POSSIBLE APCO CUSTOMER","POSSIBLE APCO CUSTOMER"]
[22964,22964,"VA","POSSIBLE APCO CUSTOMER","POSSIBLE APCO CUSTOMER"]
[22967,22967,"VA","POSSIBLE APCO CUSTOMER","POSSIBLE APCO CUSTOMER"]
[22969,22969,"VA","POSSIBLE APCO CUSTOMER","POSSIBLE APCO CUSTOMER"]
[22971,22971,"VA","POSSIBLE APCO CUSTOMER","POSSIBLE APCO CUSTOMER"]
[22976,22976,"VA","POSSIBLE APCO CUSTOMER","POSSIBLE APCO CUSTOMER"]
[24011,24011,"VA","APCO CUSTOMER","APCO CUSTOMER"]
[24012,24012,"VA","APCO CUSTOMER","APCO CUSTOMER"]
[24013,24013,"VA","APCO CUSTOMER","APCO CUSTOMER"]
[24014,24014,"VA","APCO CUSTOMER","APCO CUSTOMER"]
[24015,24015,"VA","APCO CUSTOMER","APCO CUSTOMER"]
[24016,24016,"VA","APCO CUSTOMER","APCO CUSTOMER"]
[24017,24017,"VA","POSSIBLE APCO CUSTOMER","POSSIBLE APCO CUSTOMER"]
[24018,24018,"VA","POSSIBLE APCO CUSTOMER","POSSIBLE APCO CUSTOMER"]
[24019,24019,"VA","POSSIBLE APCO CUSTOMER","POSSIBLE APCO CUSTOMER"]
[24053,24053,"VA","POSSIBLE APCO CUSTOMER","POSSIBLE APCO CUSTOMER"]
[24054,24054,"VA","POSSIBLE APCO CUSTOMER","POSSIBLE APCO CUSTOMER"]
[24055,24055,"VA","APCO CUSTOMER","APCO CUSTOMER"]
[24058,24058,"VA","APCO CUSTOMER","APCO CUSTOMER"]
[24059,24059,"VA","APCO CUSTOMER","APCO CUSTOMER"]
[24060,24060,"VA","POSSIBLE APCO CUSTOMER","POSSIBLE APCO CUSTOMER"]
[24062,24062,"VA","POSSIBLE APCO CUSTOMER","POSSIBLE APCO CUSTOMER"]
[24063,24063,"VA","POSSIBLE APCO CUSTOMER","POSSIBLE APCO CUSTOMER"]
[24064,24064,"VA","APCO CUSTOMER","APCO CUSTOMER"]
[24065,24065,"VA","APCO CUSTOMER","APCO CUSTOMER"]
[24066,24066,"VA","POSSIBLE APCO CUSTOMER","POSSIBLE APCO CUSTOMER"]
[24067,24067,"VA","APCO CUSTOMER","APCO CUSTOMER"]
[24068,24068,"VA","APCO CUSTOMER","APCO CUSTOMER"]
[24069,24069,"VA","POSSIBLE APCO CUSTOMER","POSSIBLE APCO CUSTOMER"]
[24070,24070,"VA","POSSIBLE APCO CUSTOMER","POSSIBLE APCO CUSTOMER"]
[24072,24072,"VA","APCO CUSTOMER","APCO CUSTOMER"]
[24073,24073,"VA","APCO CUSTOMER","APCO CUSTOMER"]
[24076,24076,"VA","POSSIBLE APCO CUSTOMER","POSSIBLE APCO CUSTOMER"]
[24077,24077,"VA","APCO CUSTOMER","APCO CUSTOMER"]
[24078,24078,"VA","APCO CUSTOMER","APCO CUSTOMER"]
[24079,24079,"VA","APCO CUSTOMER","APCO CUSTOMER"]
[24082,24082,"VA","APCO CUSTOMER","APCO CUSTOMER"]
[24083,24083,"VA","APCO CUSTOMER","APCO CUSTOMER"]
[24084,24084,"VA","APCO CUSTOMER","APCO CUSTOMER"]
[24086,24086,"VA","APCO CUSTOMER","APCO CUSTOMER"]
[24087,24087,"VA","POSSIBLE APCO CUSTOMER","POSSIBLE APCO CUSTOMER"]
[24088,24088,"VA","APCO CUSTOMER","APCO CUSTOMER"]
[24089,24089,"VA","APCO CUSTOMER","APCO CUSTOMER"]
[24090,24090,"VA","POSSIBLE APCO CUSTOMER","POSSIBLE APCO CUSTOMER"]
[24091,24091,"VA","APCO CUSTOMER","APCO CUSTOMER"]
[24092,24092,"VA","APCO CUSTOMER","APCO CUSTOMER"]
[24093,24093,"VA","APCO CUSTOMER","APCO CUSTOMER"]
[24095,24095,"VA","POSSIBLE APCO CUSTOMER","POSSIBLE APCO CUSTOMER"]
[24101,24101,"VA","APCO CUSTOMER","APCO CUSTOMER"]
[24102,24102,"VA","APCO CUSTOMER","APCO CUSTOMER"]
[24104,24104,"VA","POSSIBLE APCO CUSTOMER","POSSIBLE APCO CUSTOMER"]
[24105,24105,"VA","APCO CUSTOMER","APCO CUSTOMER"]
[24112,24112,"VA","POSSIBLE APCO CUSTOMER","POSSIBLE APCO CUSTOMER"]
[24114,24114,"VA","POSSIBLE APCO CUSTOMER","POSSIBLE APCO CUSTOMER"]
[24115,24115,"VA","POSSIBLE APCO CUSTOMER","POSSIBLE APCO CUSTOMER"]
[24120,24120,"VA","APCO CUSTOMER","APCO CUSTOMER"]
[24121,24121,"VA","POSSIBLE APCO CUSTOMER","POSSIBLE APCO CUSTOMER"]
[24122,24122,"VA","POSSIBLE APCO CUSTOMER","POSSIBLE APCO CUSTOMER"]
[24124,24124,"VA","APCO CUSTOMER","APCO CUSTOMER"]
[24126,24126,"VA","APCO CUSTOMER","APCO CUSTOMER"]
[24127,24127,"VA","POSSIBLE APCO CUSTOMER","POSSIBLE APCO CUSTOMER"]
[24128,24128,"VA","POSSIBLE APCO CUSTOMER","POSSIBLE APCO CUSTOMER"]
[24129,24129,"VA","POSSIBLE APCO CUSTOMER","POSSIBLE APCO CUSTOMER"]
[24132,24132,"VA","APCO CUSTOMER","APCO CUSTOMER"]
[24133,24133,"VA","APCO CUSTOMER","APCO CUSTOMER"]
[24134,24134,"VA","APCO CUSTOMER","APCO CUSTOMER"]
[24136,24136,"VA","APCO CUSTOMER","APCO CUSTOMER"]
[24137,24137,"VA","POSSIBLE APCO CUSTOMER","POSSIBLE APCO CUSTOMER"]
[24138,24138,"VA","APCO CUSTOMER","APCO CUSTOMER"]
[24141,24141,"VA","POSSIBLE APCO CUSTOMER","POSSIBLE APCO CUSTOMER"]
[24143,24143,"VA","POSSIBLE APCO CUSTOMER","POSSIBLE APCO CUSTOMER"]
[24148,24148,"VA","POSSIBLE APCO CUSTOMER","POSSIBLE APCO CUSTOMER"]
[24149,24149,"VA","APCO CUSTOMER","APCO CUSTOMER"]
[24150,24150,"VA","POSSIBLE APCO CUSTOMER","POSSIBLE APCO CUSTOMER"]
[24151,24151,"VA","APCO CUSTOMER","APCO CUSTOMER"]
[24153,24153,"VA","POSSIBLE APCO CUSTOMER","POSSIBLE APCO CUSTOMER"]
[24161,24161,"VA","POSSIBLE APCO CUSTOMER","POSSIBLE APCO CUSTOMER"]
[24162,24162,"VA","APCO CUSTOMER","APCO CUSTOMER"]
[24165,24165,"VA","POSSIBLE APCO CUSTOMER","POSSIBLE APCO CUSTOMER"]
[24167,24167,"VA","APCO CUSTOMER","APCO CUSTOMER"]
[24168,24168,"VA","APCO CUSTOMER","APCO CUSTOMER"]
[24171,24171,"VA","POSSIBLE APCO CUSTOMER","POSSIBLE APCO CUSTOMER"]
[24174,24174,"VA","APCO CUSTOMER","APCO CUSTOMER"]
[24175,24175,"VA","POSSIBLE APCO CUSTOMER","POSSIBLE APCO CUSTOMER"]
[24176,24176,"VA","APCO CUSTOMER","APCO CUSTOMER"]
[24177,24177,"VA","APCO CUSTOMER","APCO CUSTOMER"]
[24178,24178,"VA","APCO CUSTOMER","APCO CUSTOMER"]
[24179,24179,"VA","POSSIBLE APCO CUSTOMER","POSSIBLE APCO CUSTOMER"]
[24184,24184,"VA","APCO CUSTOMER","APCO CUSTOMER"]
[24185,24185,"VA","APCO CUSTOMER","APCO CUSTOMER"]
[24201,24201,"VA","NOT IN REBATE AREA","NO REBATE AVAILABLE AT THIS TIME"]
[24202,24202,"VA","POSSIBLE APCO CUSTOMER","POSSIBLE APCO CUSTOMER"]
[24203,24203,"VA","NOT IN REBATE AREA","NO REBATE AVAILABLE AT THIS TIME"]
[24205,24205,"VA","NOT IN REBATE AREA","NO REBATE AVAILABLE AT THIS TIME"]
[24209,24209,"VA","NOT IN REBATE AREA","NO REBATE AVAILABLE AT THIS TIME"]
[24210,24210,"VA","POSSIBLE APCO CUSTOMER","POSSIBLE APCO CUSTOMER"]
[24211,24211,"VA","POSSIBLE APCO CUSTOMER","POSSIBLE APCO CUSTOMER"]
[24212,24212,"VA","APCO CUSTOMER","APCO CUSTOMER"]
[24217,24217,"VA","APCO CUSTOMER","APCO CUSTOMER"]
[24219,24219,"VA","POSSIBLE APCO CUSTOMER","POSSIBLE APCO CUSTOMER"]
[24220,24220,"VA","APCO CUSTOMER","APCO CUSTOMER"]
[24221,24221,"VA","NOT IN REBATE AREA","NO REBATE AVAILABLE AT THIS TIME"]
[24224,24224,"VA","POSSIBLE APCO CUSTOMER","POSSIBLE APCO CUSTOMER"]
[24225,24225,"VA","APCO CUSTOMER","APCO CUSTOMER"]
[24226,24226,"VA","APCO CUSTOMER","APCO CUSTOMER"]
[24228,24228,"VA","POSSIBLE APCO CUSTOMER","POSSIBLE APCO CUSTOMER"]
[24230,24230,"VA","POSSIBLE APCO CUSTOMER","POSSIBLE APCO CUSTOMER"]
[24236,24236,"VA","POSSIBLE APCO CUSTOMER","POSSIBLE APCO CUSTOMER"]
[24237,24237,"VA","APCO CUSTOMER","APCO CUSTOMER"]
[24239,24239,"VA","APCO CUSTOMER","APCO CUSTOMER"]
[24243,24243,"VA","NOT IN REBATE AREA","NO REBATE AVAILABLE AT THIS TIME"]
[24244,24244,"VA","POSSIBLE APCO CUSTOMER","POSSIBLE APCO CUSTOMER"]
[24245,24245,"VA","POSSIBLE APCO CUSTOMER","POSSIBLE APCO CUSTOMER"]
[24248,24248,"VA","NOT IN REBATE AREA","NO REBATE AVAILABLE AT THIS TIME"]
[24250,24250,"VA","APCO CUSTOMER","APCO CUSTOMER"]
[24251,24251,"VA","POSSIBLE APCO CUSTOMER","POSSIBLE APCO CUSTOMER"]
[24256,24256,"VA","POSSIBLE APCO CUSTOMER","POSSIBLE APCO CUSTOMER"]
[24258,24258,"VA","POSSIBLE APCO CUSTOMER","POSSIBLE APCO CUSTOMER"]
[24260,24260,"VA","APCO CUSTOMER","APCO CUSTOMER"]
[24263,24263,"VA","NOT IN REBATE AREA","NO REBATE AVAILABLE AT THIS TIME"]
[24265,24265,"VA","NOT IN REBATE AREA","NO REBATE AVAILABLE AT THIS TIME"]
[24266,24266,"VA","APCO CUSTOMER","APCO CUSTOMER"]
[24269,24269,"VA","APCO CUSTOMER","APCO CUSTOMER"]
[24270,24270,"VA","POSSIBLE APCO CUSTOMER","POSSIBLE APCO CUSTOMER"]
[24271,24271,"VA","POSSIBLE APCO CUSTOMER","POSSIBLE APCO CUSTOMER"]
[24272,24272,"VA","POSSIBLE APCO CUSTOMER","POSSIBLE APCO CUSTOMER"]
[24273,24273,"VA","POSSIBLE APCO CUSTOMER","POSSIBLE APCO CUSTOMER"]
[24277,24277,"VA","NOT IN REBATE AREA","NO REBATE AVAILABLE AT THIS TIME"]
[24279,24279,"VA","POSSIBLE APCO CUSTOMER","POSSIBLE APCO CUSTOMER"]
[24280,24280,"VA","APCO CUSTOMER","APCO CUSTOMER"]
[24281,24281,"VA","NOT IN REBATE AREA","NO REBATE AVAILABLE AT THIS TIME"]
[24282,24282,"VA","NOT IN REBATE AREA","NO REBATE AVAILABLE AT THIS TIME"]
[24283,24283,"VA","POSSIBLE APCO CUSTOMER","POSSIBLE APCO CUSTOMER"]
[24290,24290,"VA","POSSIBLE APCO CUSTOMER","POSSIBLE APCO CUSTOMER"]
[24292,24292,"VA","POSSIBLE APCO CUSTOMER","POSSIBLE APCO CUSTOMER"]
[24293,24293,"VA","POSSIBLE APCO CUSTOMER","POSSIBLE APCO CUSTOMER"]
[24301,24301,"VA","APCO CUSTOMER","APCO CUSTOMER"]
[24311,24311,"VA","APCO CUSTOMER","APCO CUSTOMER"]
[24312,24312,"VA","APCO CUSTOMER","APCO CUSTOMER"]
[24313,24313,"VA","APCO CUSTOMER","APCO CUSTOMER"]
[24314,24314,"VA","APCO CUSTOMER","APCO CUSTOMER"]
[24315,24315,"VA","APCO CUSTOMER","APCO CUSTOMER"]
[24316,24316,"VA","APCO CUSTOMER","APCO CUSTOMER"]
[24317,24317,"VA","POSSIBLE APCO CUSTOMER","POSSIBLE APCO CUSTOMER"]
[24318,24318,"VA","APCO CUSTOMER","APCO CUSTOMER"]
[24319,24319,"VA","APCO CUSTOMER","APCO CUSTOMER"]
[24322,24322,"VA","APCO CUSTOMER","APCO CUSTOMER"]
[24323,24323,"VA","APCO CUSTOMER","APCO CUSTOMER"]
[24324,24324,"VA","APCO CUSTOMER","APCO CUSTOMER"]
[24325,24325,"VA","APCO CUSTOMER","APCO CUSTOMER"]
[24326,24326,"VA","APCO CUSTOMER","APCO CUSTOMER"]
[24327,24327,"VA","APCO CUSTOMER","APCO CUSTOMER"]
[24328,24328,"VA","APCO CUSTOMER","APCO CUSTOMER"]
[24330,24330,"VA","POSSIBLE APCO CUSTOMER","POSSIBLE APCO CUSTOMER"]
[24333,24333,"VA","POSSIBLE APCO CUSTOMER","POSSIBLE APCO CUSTOMER"]
[24340,24340,"VA","APCO CUSTOMER","APCO CUSTOMER"]
[24343,24343,"VA","APCO CUSTOMER","APCO CUSTOMER"]
[24347,24347,"VA","APCO CUSTOMER","APCO CUSTOMER"]
[24348,24348,"VA","POSSIBLE APCO CUSTOMER","POSSIBLE APCO CUSTOMER"]
[24350,24350,"VA","APCO CUSTOMER","APCO CUSTOMER"]
[24351,24351,"VA","POSSIBLE APCO CUSTOMER","POSSIBLE APCO CUSTOMER"]
[24352,24352,"VA","APCO CUSTOMER","APCO CUSTOMER"]
[24354,24354,"VA","APCO CUSTOMER","APCO CUSTOMER"]
[24360,24360,"VA","APCO CUSTOMER","APCO CUSTOMER"]
[24361,24361,"VA","APCO CUSTOMER","APCO CUSTOMER"]
[24363,24363,"VA","POSSIBLE APCO CUSTOMER","POSSIBLE APCO CUSTOMER"]
[24366,24366,"VA","APCO CUSTOMER","APCO CUSTOMER"]
[24368,24368,"VA","APCO CUSTOMER","APCO CUSTOMER"]
[24370,24370,"VA","APCO CUSTOMER","APCO CUSTOMER"]
[24374,24374,"VA","APCO CUSTOMER","APCO CUSTOMER"]
[24375,24375,"VA","APCO CUSTOMER","APCO CUSTOMER"]
[24378,24378,"VA","APCO CUSTOMER","APCO CUSTOMER"]
[24380,24380,"VA","APCO CUSTOMER","APCO CUSTOMER"]
[24381,24381,"VA","APCO CUSTOMER","APCO CUSTOMER"]
[24382,24382,"VA","APCO CUSTOMER","APCO CUSTOMER"]
[24501,24501,"VA","APCO CUSTOMER","APCO CUSTOMER"]
[24502,24502,"VA","APCO CUSTOMER","APCO CUSTOMER"]
[24503,24503,"VA","APCO CUSTOMER","APCO CUSTOMER"]
[24504,24504,"VA","POSSIBLE APCO CUSTOMER","POSSIBLE APCO CUSTOMER"]
[24514,24514,"VA","APCO CUSTOMER","APCO CUSTOMER"]
[24521,24521,"VA","POSSIBLE APCO CUSTOMER","POSSIBLE APCO CUSTOMER"]
[24523,24523,"VA","POSSIBLE APCO CUSTOMER","POSSIBLE APCO CUSTOMER"]
[24526,24526,"VA","POSSIBLE APCO CUSTOMER","POSSIBLE APCO CUSTOMER"]
[24530,24530,"VA","POSSIBLE APCO CUSTOMER","POSSIBLE APCO CUSTOMER"]
[24531,24531,"VA","POSSIBLE APCO CUSTOMER","POSSIBLE APCO CUSTOMER"]
[24533,24533,"VA","POSSIBLE APCO CUSTOMER","POSSIBLE APCO CUSTOMER"]
[24536,24536,"VA","APCO CUSTOMER","APCO CUSTOMER"]
[24538,24538,"VA","POSSIBLE APCO CUSTOMER","POSSIBLE APCO CUSTOMER"]
[24550,24550,"VA","POSSIBLE APCO CUSTOMER","POSSIBLE APCO CUSTOMER"]
[24551,24551,"VA","POSSIBLE APCO CUSTOMER","POSSIBLE APCO CUSTOMER"]
[24553,24553,"VA","POSSIBLE APCO CUSTOMER","POSSIBLE APCO CUSTOMER"]
[24554,24554,"VA","POSSIBLE APCO CUSTOMER","POSSIBLE APCO CUSTOMER"]
[24556,24556,"VA","POSSIBLE APCO CUSTOMER","POSSIBLE APCO CUSTOMER"]
[24570,24570,"VA","POSSIBLE APCO CUSTOMER","POSSIBLE APCO CUSTOMER"]
[24572,24572,"VA","POSSIBLE APCO CUSTOMER","POSSIBLE APCO CUSTOMER"]
[24574,24574,"VA","POSSIBLE APCO CUSTOMER","POSSIBLE APCO CUSTOMER"]
[24588,24588,"VA","POSSIBLE APCO CUSTOMER","POSSIBLE APCO CUSTOMER"]
[24590,24590,"VA","POSSIBLE APCO CUSTOMER","POSSIBLE APCO CUSTOMER"]
[24595,24595,"VA","POSSIBLE APCO CUSTOMER","POSSIBLE APCO CUSTOMER"]
[24599,24599,"VA","POSSIBLE APCO CUSTOMER","POSSIBLE APCO CUSTOMER"]
[24601,24601,"VA","APCO CUSTOMER","APCO CUSTOMER"]
[24602,24602,"VA","APCO CUSTOMER","APCO CUSTOMER"]
[24603,24603,"VA","POSSIBLE APCO CUSTOMER","POSSIBLE APCO CUSTOMER"]
[24604,24604,"VA","APCO CUSTOMER","APCO CUSTOMER"]
[24605,24605,"VA","APCO CUSTOMER","APCO CUSTOMER"]
[24606,24606,"VA","APCO CUSTOMER","APCO CUSTOMER"]
[24607,24607,"VA","POSSIBLE APCO CUSTOMER","POSSIBLE APCO CUSTOMER"]
[24608,24608,"VA","APCO CUSTOMER","APCO CUSTOMER"]
[24609,24609,"VA","APCO CUSTOMER","APCO CUSTOMER"]
[24612,24612,"VA","POSSIBLE APCO CUSTOMER","POSSIBLE APCO CUSTOMER"]
[24613,24613,"VA","APCO CUSTOMER","APCO CUSTOMER"]
[24614,24614,"VA","POSSIBLE APCO CUSTOMER","POSSIBLE APCO CUSTOMER"]
[24619,24619,"VA","APCO CUSTOMER","APCO CUSTOMER"]
[24620,24620,"VA","POSSIBLE APCO CUSTOMER","POSSIBLE APCO CUSTOMER"]
[24622,24622,"VA","APCO CUSTOMER","APCO CUSTOMER"]
[24624,24624,"VA","APCO CUSTOMER","APCO CUSTOMER"]
[24627,24627,"VA","APCO CUSTOMER","APCO CUSTOMER"]
[24628,24628,"VA","POSSIBLE APCO CUSTOMER","POSSIBLE APCO CUSTOMER"]
[24630,24630,"VA","APCO CUSTOMER","APCO CUSTOMER"]
[24631,24631,"VA","APCO CUSTOMER","APCO CUSTOMER"]
[24634,24634,"VA","APCO CUSTOMER","APCO CUSTOMER"]
[24635,24635,"VA","APCO CUSTOMER","APCO CUSTOMER"]
[24637,24637,"VA","APCO CUSTOMER","APCO CUSTOMER"]
[24639,24639,"VA","APCO CUSTOMER","APCO CUSTOMER"]
[24640,24640,"VA","APCO CUSTOMER","APCO CUSTOMER"]
[24641,24641,"VA","POSSIBLE APCO CUSTOMER","POSSIBLE APCO CUSTOMER"]
[24646,24646,"VA","APCO CUSTOMER","APCO CUSTOMER"]
[24647,24647,"VA","APCO CUSTOMER","APCO CUSTOMER"]
[24649,24649,"VA","APCO CUSTOMER","APCO CUSTOMER"]
[24651,24651,"VA","APCO CUSTOMER","APCO CUSTOMER"]
[24656,24656,"VA","APCO CUSTOMER","APCO CUSTOMER"]
[24657,24657,"VA","APCO CUSTOMER","APCO CUSTOMER"]
[24658,24658,"VA","APCO CUSTOMER","APCO CUSTOMER"]

{"sheet":"Sheet1","index":2,"n_rows":1,"n_cols":1,"rows_kept":1,"cut":false,"hidden":true,"merged":[]}
["http://www.research-alliance.org/TVARequestForm.html"]